[Author Prev][Author Next][Thread Prev][Thread Next][Author Index][Thread Index]

Re: tor- 'make check' failure on OSX 10.4.2

Is this all on OSX?

OpenMacNews wrote:

hi all,

i'm building tor- on OSX 10.4.2 from src.

the built binary seems to run fine, but a 'make check' fails with:

% make check
Making check in src
Making check in common
make[2]: Nothing to be done for `check'.
Making check in or
make check-TESTS
config.c:1343 config_init: Assertion (fmt)->magic ==
*(uint32_t*)(((char*)(options))+fmt->magic_offset) failed; aborting.
FAIL: test
1 of 1 tests failed
make[3]: *** [check-TESTS] Error 1
make[2]: *** [check-am] Error 2
make[1]: *** [check-recursive] Error 1
make: *** [check-recursive] Error 1