[Author Prev][Author Next][Thread Prev][Thread Next][Author Index][Thread Index]

Re: 0.4.0 Testing

> Now, in this case, is no news good news, or is
> just nobody checking it out..?

Hmmmm.. I have tried it out, and I got a problem:
In file included from /usr/include/SDL/SDL_endian.h:60,
                 from ../../src/common/fileio.h:42,
                 from player.h:26,
                 from unit.h:27,
                 from map.h:28,
                 from mission.h:26,
                 from game.h:26,
                 from game.cpp:25:
/usr/include/asm/byteorder.h:6:2: warning: #warning using private kernel
header; include <endian.h> instead!
game.cpp: In member function `int Game::Load(const char*)':
game.cpp:317: error: `cerr' undeclared (first use this function)
game.cpp:317: error: (Each undeclared identifier is reported only once
for each
   function it appears in.)
game.cpp:317: error: `endl' undeclared (first use this function)
make[2]: *** [game.o] Error 1
make[2]: Leaving directory `/home/network/crimson-0.4.0pre1/src/cf'
make[1]: *** [all-recursive] Error 1
make[1]: Leaving directory `/home/network/crimson-0.4.0pre1/src'
make: *** [all-recursive] Error 1

Maybe this helps.

Brain at Taipei

 PChome交友~~幸福天天有 \*^o^*//